{"text_format":"3","workbook":"xlsx","n_sheets":8,"sheets":["Welcome","Periodic table","PTSearch","Elements","Compound list","Compound properties","Practice","Do more"],"not_rendered":{"images":23,"defined_names":9},"read":"whole","date_system":"1900"}

{"sheet":"Welcome","index":0,"n_rows":16,"n_cols":16,"rows_kept":16,"merged":[[3,1,3,11],[6,2,6,4],[6,8,6,10],[6,14,6,16],[11,2,11,4],[11,8,11,10],[11,14,11,16],[15,1,15,5]]}
[null,null,"Refresh the workbook whenever you want to get the most up-to-date data for this template. Go to the Data tab  > Refresh All."]
[]
[null,"Periodic table"]
[null,"Whether you're working on a school project or simply curious about science, this list will help you discover the fundamentals of chemistry. "]
[]
[]
[null,null,"Search and interact with the periodic table",{"$nulls":5},"Compare elemental properties",{"$nulls":5},"Track chemical compounds"]
[{"$nulls":3},"Periodic table",{"$nulls":5},"Elements",{"$nulls":5},"Compound list"]
[]
[]
[]
[null,null,"Explore chemical compound properties",{"$nulls":5},"Show your understanding",{"$nulls":5},"Do more with data types"]
[{"$nulls":3},"Compound properties",{"$nulls":5},"Practice",{"$nulls":5},"Do more"]
[]
[]
{"$rows_left_out":2}
{"sheet":"Periodic table","index":1,"n_rows":50,"n_cols":38,"rows_kept":50,"merged":[[12,9,12,13],[12,19,12,23]]}
[]
[]
[null,"Periodic table"]
[null,"Use the search and property filters to explore interesting patterns and highlight data. "]
[null,null,"Group",1,null,2,null,3,null,4,null,5,null,6,null,7,null,8,null,9,null,10,null,11,null,12,null,13,null,14,null,15,null,16,null,17,null,18]
[null,"Period"]
[{"$nulls":3},1,{"$nulls":33},2]
[null,1,null,"H",{"$nulls":33},"He"]
[{"$nulls":3},{"$f":"_xlfn.XLOOKUP(D8,Table1[Atomic symbol],Table1[Element])","v":{"$error":"#VALUE!"}},{"$nulls":33},{"$f":"_xlfn.SINGLE(_xlfn.XLOOKUP(AL8,Table1[Atomic symbol],Table1[Element]))","v":{"$error":"#VALUE!"}}]
[{"$nulls":3},{"$f":"IFERROR(_xlfn.FIELDVALUE(_xlfn.XLOOKUP(D8,Table1[Atomic symbol],Table1[Element]),pt_color),\"\")","v":75},{"$nulls":5},"Search the periodic table:",{"$nulls":9},"Select a property to highlight in the table:",{"$nulls":17},{"$f":"IFERROR(_xlfn.FIELDVALUE(_xlfn.XLOOKUP(AL8,Table1[Atomic symbol],Table1[Element]),pt_color),\"\")","v":{"v":23,"d":"23.000"}}]
[]
[{"$nulls":3},3,null,4,{"$nulls":21},5,null,6,null,7,null,8,null,9,null,10]
[null,2,null,"Li",null,"Be",{"$nulls":13},"Universe Abundance",{"$nulls":7},"B",null,"C",null,"N",null,"O",null,"F",null,"Ne"]
[{"$nulls":3},{"$f":"_xlfn.XLOOKUP(D13,Table1[Atomic symbol],Table1[Element])","v":{"$error":"#VALUE!"}},null,{"$f":"_xlfn.XLOOKUP(F13,Table1[Atomic symbol],Table1[Element])","v":{"$error":"#VALUE!"}},{"$nulls":3},"Enter a name, symbol, or number.",{"$nulls":17},{"$f":"_xlfn.SINGLE(_xlfn.XLOOKUP(AB13,Table1[Atomic symbol],Table1[Element]))","v":{"$error":"#VALUE!"}},null,{"$f":"_xlfn.SINGLE(_xlfn.XLOOKUP(AD13,Table1[Atomic symbol],Table1[Element]))","v":{"$error":"#VALUE!"}},null,{"$f":"_xlfn.SINGLE(_xlfn.XLOOKUP(AF13,Table1[Atomic symbol],Table1[Element]))","v":{"$error":"#VALUE!"}},null,{"$f":"_xlfn.SINGLE(_xlfn.XLOOKUP(AH13,Table1[Atomic symbol],Table1[Element]))","v":{"$error":"#VALUE!"}},null,{"$f":"_xlfn.SINGLE(_xlfn.XLOOKUP(AJ13,Table1[Atomic symbol],Table1[Element]))","v":{"$error":"#VALUE!"}},null,{"$f":"_xlfn.SINGLE(_xlfn.XLOOKUP(AL13,Table1[Atomic symbol],Table1[Element]))","v":{"$error":"#VALUE!"}}]
[{"$nulls":3},{"$f":"IFERROR(_xlfn.FIELDVALUE(_xlfn.XLOOKUP(D13,Table1[Atomic symbol],Table1[Element]),pt_color),\"\")","v":6.0000000000001458E-7},null,{"$f":"IFERROR(_xlfn.FIELDVALUE(_xlfn.XLOOKUP(F13,Table1[Atomic symbol],Table1[Element]),pt_color),\"\")","v":{"v":1e-07,"d":"0.000"}},{"$nulls":21},{"$f":"IFERROR(_xlfn.FIELDVALUE(_xlfn.XLOOKUP(AB13,Table1[Atomic symbol],Table1[Element]),pt_color),\"\")","v":{"v":1e-07,"d":"0.000"}},null,{"$f":"IFERROR(_xlfn.FIELDVALUE(_xlfn.XLOOKUP(AD13,Table1[Atomic symbol],Table1[Element]),pt_color),\"\")","v":{"v":0.5,"d":"0.500"}},null,{"$f":"IFERROR(_xlfn.FIELDVALUE(_xlfn.XLOOKUP(AF13,Table1[Atomic symbol],Table1[Element]),pt_color),\"\")","v":{"v":0.1,"d":"0.100"}},null,{"$f":"IFERROR(_xlfn.FIELDVALUE(_xlfn.XLOOKUP(AH13,Table1[Atomic symbol],Table1[Element]),pt_color),\"\")","v":{"v":1,"d":"1.000"}},null,{"$f":"IFERROR(_xlfn.FIELDVALUE(_xlfn.XLOOKUP(AJ13,Table1[Atomic symbol],Table1[Element]),pt_color),\"\")","v":{"v":4.0000000000000972E-5,"d":"0.000"}},null,{"$f":"IFERROR(_xlfn.FIELDVALUE(_xlfn.XLOOKUP(AL13,Table1[Atomic symbol],Table1[Element]),pt_color),\"\")","v":{"v":0.13,"d":"0.130"}}]
{"$rows_left_out":36}
{"sheet":"PTSearch","index":2,"n_rows":48,"n_cols":39,"rows_kept":48,"hidden":true}
[{"$f":"IF(pt_search <> \"\",TRUE,FALSE)","v":false}]
[{"$f":"IF(pt_color <> \"\",TRUE,FALSE)","v":true},"✓"]
[]
["Property DV"]
["Atomic Mass",{"$f":"Table11[Property DV]","v":"Atomic Mass"},null,{"$f":"IF(pt_search='Periodic table'!D7,1,0)","v":0},{"$f":"D8","v":0},{"$nulls":32},{"$f":"IF(pt_search='Periodic table'!AL7,1,0)","v":0},{"$f":"AL8","v":0}]
["Atomic radius","Atomic radius",null,{"$f":"IF(pt_search='Periodic table'!D8,1,0)","v":0},{"$f":"D8","v":0},{"$nulls":32},{"$f":"IF(pt_search='Periodic table'!AL8,1,0)","v":0},{"$f":"AL8","v":0}]
["Block","Block",null,{"$f":"IFERROR(IF(pt_search <> \"\",IF(SEARCH(pt_search,_FV('Periodic table'!D9,\"name\")),1,0),0),0)","v":0},{"$f":"D8","v":0},{"$nulls":32},{"$f":"IFERROR(IF(pt_search <> \"\",IF(SEARCH(pt_search,_FV('Periodic table'!AL9,\"name\")),1,0),0),0)","v":0},{"$f":"AL8","v":0}]
["Boiling Point","Boiling Point",null,{"$f":"MAX(D5:D7)","v":0},{"$f":"D8","v":0},{"$nulls":32},{"$f":"MAX(AL5:AL7)","v":0},{"$f":"AL8","v":0}]
["Covalent radius","Covalent radius"]
["Crust Abundance","Crust Abundance",null,{"$f":"IF(pt_search='Periodic table'!D12,1,0)","v":0},{"$f":"D13","v":0},{"$f":"IF(pt_search='Periodic table'!F12,1,0)","v":0},{"$f":"F13","v":0},{"$nulls":20},{"$f":"IF(pt_search='Periodic table'!AB12,1,0)","v":0},{"$f":"AB13","v":0},{"$f":"IF(pt_search='Periodic table'!AD12,1,0)","v":0},{"$f":"AD13","v":0},{"$f":"IF(pt_search='Periodic table'!AF12,1,0)","v":0},{"$f":"AF13","v":0},{"$f":"IF(pt_search='Periodic table'!AH12,1,0)","v":0},{"$f":"AH13","v":0},{"$f":"IF(pt_search='Periodic table'!AJ12,1,0)","v":0},{"$f":"AJ13","v":0},{"$f":"IF(pt_search='Periodic table'!AL12,1,0)","v":0},{"$f":"AL13","v":0}]
["Discovery year","Discovery year",null,{"$f":"IF(pt_search='Periodic table'!D13,1,0)","v":0},{"$f":"D13","v":0},{"$f":"IF(pt_search='Periodic table'!F13,1,0)","v":0},{"$f":"F13","v":0},{"$nulls":20},{"$f":"IF(pt_search='Periodic table'!AB13,1,0)","v":0},{"$f":"AB13","v":0},{"$f":"IF(pt_search='Periodic table'!AD13,1,0)","v":0},{"$f":"AD13","v":0},{"$f":"IF(pt_search='Periodic table'!AF13,1,0)","v":0},{"$f":"AF13","v":0},{"$f":"IF(pt_search='Periodic table'!AH13,1,0)","v":0},{"$f":"AH13","v":0},{"$f":"IF(pt_search='Periodic table'!AJ13,1,0)","v":0},{"$f":"AJ13","v":0},{"$f":"IF(pt_search='Periodic table'!AL13,1,0)","v":0},{"$f":"AL13","v":0}]
["Electron affinity","Electron affinity",null,{"$f":"IFERROR(IF(pt_search <> \"\",IF(SEARCH(pt_search,_FV('Periodic table'!D14,\"name\")),1,0),0),0)","v":0},{"$f":"D13","v":0},{"$f":"IFERROR(IF(pt_search <> \"\",IF(SEARCH(pt_search,_FV('Periodic table'!F14,\"name\")),1,0),0),0)","v":0},{"$f":"F13","v":0},{"$nulls":20},{"$f":"IFERROR(IF(pt_search <> \"\",IF(SEARCH(pt_search,_FV('Periodic table'!AB14,\"name\")),1,0),0),0)","v":0},{"$f":"AB13","v":0},{"$f":"IFERROR(IF(pt_search <> \"\",IF(SEARCH(pt_search,_FV('Periodic table'!AD14,\"name\")),1,0),0),0)","v":0},{"$f":"AD13","v":0},{"$f":"IFERROR(IF(pt_search <> \"\",IF(SEARCH(pt_search,_FV('Periodic table'!AF14,\"name\")),1,0),0),0)","v":0},{"$f":"AF13","v":0},{"$f":"IFERROR(IF(pt_search <> \"\",IF(SEARCH(pt_search,_FV('Periodic table'!AH14,\"name\")),1,0),0),0)","v":0},{"$f":"AH13","v":0},{"$f":"IFERROR(IF(pt_search <> \"\",IF(SEARCH(pt_search,_FV('Periodic table'!AJ14,\"name\")),1,0),0),0)","v":0},{"$f":"AJ13","v":0},{"$f":"IFERROR(IF(pt_search <> \"\",IF(SEARCH(pt_search,_FV('Periodic table'!AL14,\"name\")),1,0),0),0)","v":0},{"$f":"AL13","v":0}]
["Electronegativity","Electronegativity",null,{"$f":"MAX(D10:D12)","v":0},{"$f":"D13","v":0},{"$f":"MAX(F10:F12)","v":0},{"$f":"F13","v":0},{"$nulls":20},{"$f":"MAX(AB10:AB12)","v":0},{"$f":"AB13","v":0},{"$f":"MAX(AD10:AD12)","v":0},{"$f":"AD13","v":0},{"$f":"MAX(AF10:AF12)","v":0},{"$f":"AF13","v":0},{"$f":"MAX(AH10:AH12)","v":0},{"$f":"AH13","v":0},{"$f":"MAX(AJ10:AJ12)","v":0},{"$f":"AJ13","v":0},{"$f":"MAX(AL10:AL12)","v":0},{"$f":"AL13","v":0}]
["Group","Group"]
["Human Abundance","Human Abundance",null,{"$f":"IF(pt_search='Periodic table'!D17,1,0)","v":0},{"$f":"D18","v":0},{"$f":"IF(pt_search='Periodic table'!F17,1,0)","v":0},{"$f":"F18","v":0},{"$nulls":20},{"$f":"IF(pt_search='Periodic table'!AB17,1,0)","v":0},{"$f":"AB18","v":0},{"$f":"IF(pt_search='Periodic table'!AD17,1,0)","v":0},{"$f":"AD18","v":0},{"$f":"IF(pt_search='Periodic table'!AF17,1,0)","v":0},{"$f":"AF18","v":0},{"$f":"IF(pt_search='Periodic table'!AH17,1,0)","v":0},{"$f":"AH18","v":0},{"$f":"IF(pt_search='Periodic table'!AJ17,1,0)","v":0},{"$f":"AJ18","v":0},{"$f":"IF(pt_search='Periodic table'!AL17,1,0)","v":0},{"$f":"AL18","v":0}]
{"$rows_left_out":34}
{"sheet":"Elements","index":3,"n_rows":126,"n_cols":4,"rows_kept":126,"merged":[[4,2,4,5],[5,2,5,3],[5,4,5,5]]}
[]
[]
[null,"Compare elemental properties"]
[null,"Use the table below to add elemental properties and compare them. "]
[null,null,"Click the icon next to an element to view more data about it."]
[null,null,"To add more columns of information, select an element and then click on the Add Column icon in the top right corner of the list."]
[]
[null,"Blank","Element","Atomic symbol"]
[null,null,{"$error":"#VALUE!"},{"$f":"_FV(Table1[[#This Row],[Element]],\"atomic symbol\",TRUE)","v":"H"}]
[null,null,{"$error":"#VALUE!"},{"$f":"_FV(Table1[[#This Row],[Element]],\"atomic symbol\",TRUE)","v":"He"}]
[null,null,{"$error":"#VALUE!"},{"$f":"_FV(Table1[[#This Row],[Element]],\"atomic symbol\",TRUE)","v":"Li"}]
[null,null,{"$error":"#VALUE!"},{"$f":"_FV(Table1[[#This Row],[Element]],\"atomic symbol\",TRUE)","v":"Be"}]
[null,null,{"$error":"#VALUE!"},{"$f":"_FV(Table1[[#This Row],[Element]],\"atomic symbol\",TRUE)","v":"B"}]
[null,null,{"$error":"#VALUE!"},{"$f":"_FV(Table1[[#This Row],[Element]],\"atomic symbol\",TRUE)","v":"C"}]
[null,null,{"$error":"#VALUE!"},{"$f":"_FV(Table1[[#This Row],[Element]],\"atomic symbol\",TRUE)","v":"N"}]
{"$rows_left_out":112}
{"sheet":"Compound list","index":4,"n_rows":17,"n_cols":4,"rows_kept":17,"merged":[[3,1,3,4],[4,2,4,4],[5,2,5,4],[6,2,6,4]]}
[]
[]
[null,"Track chemical compounds"]
[null,"Keep track of your favorite chemical compounds and use the Compound properties sheet to learn more about them. To add compounds to the list, edit the examples or type below the last compound in the blue highlighted cell."]
[null,null,"Click the icon next to a compound to view more data about it."]
[null,null,"If you don't see data for a chemical compond, you may need to convert it to the Chemistry data type: select the chemical compound name, go to the Data tab, and in the Data Types gallery, select the Chemistry icon. "]
[null,null,"To add more columns of information, select an element and then click on the Add Column icon in the top right corner of the list."]
[]
[null,"Blank","Compound","Formula"]
[null,null,{"$error":"#VALUE!"},{"$f":"IFERROR(SUBSTITUTE(SUBSTITUTE(SUBSTITUTE(SUBSTITUTE(SUBSTITUTE(SUBSTITUTE(SUBSTITUTE(SUBSTITUTE(SUBSTITUTE(SUBSTITUTE(_FV(C10,\"formula string\",TRUE),\"0\",\"₀\"),\"1\",\"₁\"),\"2\",\"₂\"),\"3\",\"₃\"),\"4\",\"₄\"),\"5\",\"₅\"),\"6\",\"₆\"),\"7\",\"₇\"),\"8\",\"₈\"),\"9\",\"₉\"),\"\")","v":"NH₃"}]
[null,null,{"$error":"#VALUE!"},{"$f":"IFERROR(SUBSTITUTE(SUBSTITUTE(SUBSTITUTE(SUBSTITUTE(SUBSTITUTE(SUBSTITUTE(SUBSTITUTE(SUBSTITUTE(SUBSTITUTE(SUBSTITUTE(_FV(C11,\"formula string\",TRUE),\"0\",\"₀\"),\"1\",\"₁\"),\"2\",\"₂\"),\"3\",\"₃\"),\"4\",\"₄\"),\"5\",\"₅\"),\"6\",\"₆\"),\"7\",\"₇\"),\"8\",\"₈\"),\"9\",\"₉\"),\"\")","v":"CO₂"}]
[null,null,{"$error":"#VALUE!"},{"$f":"IFERROR(SUBSTITUTE(SUBSTITUTE(SUBSTITUTE(SUBSTITUTE(SUBSTITUTE(SUBSTITUTE(SUBSTITUTE(SUBSTITUTE(SUBSTITUTE(SUBSTITUTE(_FV(C12,\"formula string\",TRUE),\"0\",\"₀\"),\"1\",\"₁\"),\"2\",\"₂\"),\"3\",\"₃\"),\"4\",\"₄\"),\"5\",\"₅\"),\"6\",\"₆\"),\"7\",\"₇\"),\"8\",\"₈\"),\"9\",\"₉\"),\"\")","v":"H₂O"}]
[null,null,{"$error":"#VALUE!"},{"$f":"IFERROR(SUBSTITUTE(SUBSTITUTE(SUBSTITUTE(SUBSTITUTE(SUBSTITUTE(SUBSTITUTE(SUBSTITUTE(SUBSTITUTE(SUBSTITUTE(SUBSTITUTE(_FV(C13,\"formula string\",TRUE),\"0\",\"₀\"),\"1\",\"₁\"),\"2\",\"₂\"),\"3\",\"₃\"),\"4\",\"₄\"),\"5\",\"₅\"),\"6\",\"₆\"),\"7\",\"₇\"),\"8\",\"₈\"),\"9\",\"₉\"),\"\")","v":"H₂O₂"}]
[null,null,{"$error":"#VALUE!"},{"$f":"IFERROR(SUBSTITUTE(SUBSTITUTE(SUBSTITUTE(SUBSTITUTE(SUBSTITUTE(SUBSTITUTE(SUBSTITUTE(SUBSTITUTE(SUBSTITUTE(SUBSTITUTE(_FV(C14,\"formula string\",TRUE),\"0\",\"₀\"),\"1\",\"₁\"),\"2\",\"₂\"),\"3\",\"₃\"),\"4\",\"₄\"),\"5\",\"₅\"),\"6\",\"₆\"),\"7\",\"₇\"),\"8\",\"₈\"),\"9\",\"₉\"),\"\")","v":"CH₄"}]
[null,null,{"$error":"#VALUE!"},{"$f":"IFERROR(SUBSTITUTE(SUBSTITUTE(SUBSTITUTE(SUBSTITUTE(SUBSTITUTE(SUBSTITUTE(SUBSTITUTE(SUBSTITUTE(SUBSTITUTE(SUBSTITUTE(_FV(C15,\"formula string\",TRUE),\"0\",\"₀\"),\"1\",\"₁\"),\"2\",\"₂\"),\"3\",\"₃\"),\"4\",\"₄\"),\"5\",\"₅\"),\"6\",\"₆\"),\"7\",\"₇\"),\"8\",\"₈\"),\"9\",\"₉\"),\"\")","v":"O₂U"}]
{"$rows_left_out":3}
{"sheet":"Compound properties","index":5,"n_rows":56,"n_cols":32,"rows_kept":56,"merged":[[2,21,3,21],[4,1,4,7],[4,13,5,18],[7,1,7,6],[7,7,7,12],[7,13,7,18],[8,1,8,6],[8,7,8,12],[8,13,8,18]]}
[]
[]
[null,"Explore chemical compound properties",{"$nulls":19},{"$f":"IFERROR(_FV(B5,\"structure diagram\",TRUE), \"\")","v":{"$error":"#VALUE!"}}]
[null,"Select the cell below and choose a chemical using the dropdown arrow."]
[null,{"$error":"#VALUE!"},{"$nulls":18},"blank","Formula","Elements"]
[null,{"$f":"IFERROR(_xlfn.TEXTJOIN(\", \",TRUE,_FV(B5,\"alternate names\",TRUE)),\"\")","v":"ammonia anhydrous, ammonia gas, azane, nitro-sil, spirit of hartshorn"},{"$nulls":19},{"$f":"IFERROR(SUBSTITUTE(SUBSTITUTE(SUBSTITUTE(SUBSTITUTE(SUBSTITUTE(SUBSTITUTE(SUBSTITUTE(SUBSTITUTE(SUBSTITUTE(SUBSTITUTE(_FV(B5,\"formula string\",TRUE),\"0\",\"₀\"),\"1\",\"₁\"),\"2\",\"₂\"),\"3\",\"₃\"),\"4\",\"₄\"),\"5\",\"₅\"),\"6\",\"₆\"),\"7\",\"₇\"),\"8\",\"₈\"),\"9\",\"₉\"),\"\")","v":"NH₃"},{"$f":"TRANSPOSE(_FV(B5,\"element types\",TRUE))","v":{"$error":"#VALUE!"}},{"$error":"#VALUE!"}]
[]
[null,"Molar mass",{"$nulls":5},"Density",{"$nulls":5},"Boiling point",{"$nulls":7},"Periodic table properties"]
[null,{"$f":"IFERROR(_xlfn.FIELDVALUE($B$5,B8),\"\")","v":{"v":17.031,"d":"17.031000"}},{"$nulls":5},{"$f":"IFERROR(_xlfn.FIELDVALUE($B$5,H8),\"\")","v":{"v":6.96E-4,"d":"0.000696"}},{"$nulls":5},{"$f":"IFERROR(_xlfn.FIELDVALUE($B$5,N8),\"\")","v":{"v":-33.33,"d":"-33.330000"}},{"$nulls":6},"✓","Block",{"$f":"IFERROR(_FV(W$6,\"block\"),\"\")","v":"s"},{"$f":"IFERROR(_FV(X$6,\"block\"),\"\")","v":"p"},{"$f":"IFERROR(_FV(Y$6,\"block\"),\"\")","v":""},{"$f":"IFERROR(_FV(Z$6,\"block\"),\"\")","v":""},{"$f":"IFERROR(_FV(AA$6,\"block\"),\"\")","v":""},{"$f":"IFERROR(_FV(AB$6,\"block\"),\"\")","v":""},{"$f":"IFERROR(_FV(AC$6,\"block\"),\"\")","v":""},{"$f":"IFERROR(_FV(AD$6,\"atomic symbol\",TRUE),\"\")","v":""},{"$f":"IFERROR(_FV(AE$6,\"atomic symbol\",TRUE),\"\")","v":""},{"$f":"IFERROR(_FV(AF$6,\"atomic symbol\",TRUE),\"\")","v":""}]
[{"$nulls":20},"✓","Group",{"$f":"IFERROR(_FV(W$6,\"group\"),\"\")","v":1},{"$f":"IFERROR(_FV(X$6,\"group\"),\"\")","v":15},{"$f":"IFERROR(_FV(Y$6,\"group\"),\"\")","v":""},{"$f":"IFERROR(_FV(Z$6,\"group\"),\"\")","v":""},{"$f":"IFERROR(_FV(AA$6,\"group\"),\"\")","v":""},{"$f":"IFERROR(_FV(AB$6,\"group\"),\"\")","v":""},{"$f":"IFERROR(_FV(AC$6,\"group\"),\"\")","v":""},{"$f":"IFERROR(_FV(AD$6,\"atomic number\",TRUE),\"\")","v":""},{"$f":"IFERROR(_FV(AE$6,\"atomic number\",TRUE),\"\")","v":""},{"$f":"IFERROR(_FV(AF$6,\"atomic number\",TRUE),\"\")","v":""}]
[null,"H",{"$nulls":16},"He",null,"✓","Period",{"$f":"IFERROR(_FV(W$6,\"period\"),\"\")","v":1},{"$f":"IFERROR(_FV(X$6,\"period\"),\"\")","v":2},{"$f":"IFERROR(_FV(Y$6,\"period\"),\"\")","v":""},{"$f":"IFERROR(_FV(Z$6,\"period\"),\"\")","v":""},{"$f":"IFERROR(_FV(AA$6,\"period\"),\"\")","v":""},{"$f":"IFERROR(_FV(AB$6,\"period\"),\"\")","v":""},{"$f":"IFERROR(_FV(AC$6,\"period\"),\"\")","v":""},{"$f":"IFERROR(_FV(AD$6,\"atomic mass\",TRUE),\"\")","v":""},{"$f":"IFERROR(_FV(AE$6,\"atomic mass\",TRUE),\"\")","v":""},{"$f":"IFERROR(_FV(AF$6,\"atomic mass\",TRUE),\"\")","v":""}]
[null,"Li","Be",{"$nulls":10},"B","C","N","O","F","Ne",{"$nulls":10},{"$f":"IFERROR(_FV(AD$6,\"melting point\",TRUE),\"\")","v":""},{"$f":"IFERROR(_FV(AE$6,\"melting point\",TRUE),\"\")","v":""},{"$f":"IFERROR(_FV(AF$6,\"melting point\",TRUE),\"\")","v":""}]
[null,"Na","Mg",{"$nulls":10},"Al","Si","P","S","Cl","Ar",null,null,"Basic atomic properties",{"$nulls":7},{"$f":"IFERROR(_FV(AD$6,\"boiling point\",TRUE),\"\")","v":""},{"$f":"IFERROR(_FV(AE$6,\"boiling point\",TRUE),\"\")","v":""},{"$f":"IFERROR(_FV(AF$6,\"boiling point\",TRUE),\"\")","v":""}]
[null,"K","Ca","Sc","Ti","V","Cr","Mn","Fe","Co","Ni","Cu","Zn","Ga","Ge","As","Se","Br","Kr",null,null,"Atomic symbol",{"$f":"IFERROR(_FV(W$6,\"atomic symbol\",TRUE),\"\")","v":"H"},{"$f":"IFERROR(_FV(X$6,\"atomic symbol\",TRUE),\"\")","v":"N"},{"$f":"IFERROR(_FV(Y$6,\"atomic symbol\",TRUE),\"\")","v":""},{"$f":"IFERROR(_FV(Z$6,\"atomic symbol\",TRUE),\"\")","v":""},{"$f":"IFERROR(_FV(AA$6,\"atomic symbol\",TRUE),\"\")","v":""},{"$f":"IFERROR(_FV(AB$6,\"atomic symbol\",TRUE),\"\")","v":""},{"$f":"IFERROR(_FV(AC$6,\"atomic symbol\",TRUE),\"\")","v":""}]
[null,"Rb","Sr","Y","Zr","Nb","Mo","Tc","Ru","Rh","Pd","Ag","Cd","In","Sn","Sb","Te","I","Xe",null,null,"Atomic number",{"$f":"IFERROR(_FV(W$6,\"atomic number\",TRUE),\"\")","v":1},{"$f":"IFERROR(_FV(X$6,\"atomic number\",TRUE),\"\")","v":7},{"$f":"IFERROR(_FV(Y$6,\"atomic number\",TRUE),\"\")","v":""},{"$f":"IFERROR(_FV(Z$6,\"atomic number\",TRUE),\"\")","v":""},{"$f":"IFERROR(_FV(AA$6,\"atomic number\",TRUE),\"\")","v":""},{"$f":"IFERROR(_FV(AB$6,\"atomic number\",TRUE),\"\")","v":""},{"$f":"IFERROR(_FV(AC$6,\"atomic number\",TRUE),\"\")","v":""}]
{"$rows_left_out":42}
{"sheet":"Practice","index":6,"n_rows":32,"n_cols":7,"rows_kept":32}
[]
[]
[null,"Show your understanding"]
[null,"Practice on some basic periodic table and chemical questions."]
[null,"Element questions"]
[]
[null,"Which elements have the following symbols?",{"$nulls":3},"Name 3 elements in the D block."]
[{"$f":"IF(C9,2,IF(C8<>\"\",1,0))","v":0},"H",null,null,{"$f":"IF(G9,2,IF(G8<>\"\",1,0))","v":0},1]
[null,null,{"$f":"IFERROR(IF(_FV(_xlfn.XLOOKUP($C$8,_FV(Table1[Element],\"name\"), Table1[Element],FALSE),\"atomic symbol\",TRUE)=$B$8,TRUE,FALSE),FALSE)","v":false},{"$nulls":3},{"$f":"IFERROR(IF(_FV(_xlfn.XLOOKUP(G8,_FV(Table1[Element],\"NAME\"),Table1[Element],FALSE),\"block\")=\"d\",TRUE,FALSE),FALSE)","v":false}]
[{"$f":"IF(C11,2,IF(C10<>\"\",1,0))","v":0},"Ni",null,null,{"$f":"IF(G11,2,IF(G10<>\"\",1,0))","v":0},2]
[null,null,{"$f":"IFERROR(IF(_FV(_xlfn.XLOOKUP(C10,_FV(Table1[Element],\"name\"), Table1[Element],FALSE),\"atomic symbol\",TRUE)=B10,TRUE,FALSE),FALSE)","v":false},{"$nulls":3},{"$f":"IFERROR(IF(_FV(_xlfn.XLOOKUP(G10,_FV(Table1[Element],\"NAME\"),Table1[Element],FALSE),\"block\")=\"d\",TRUE,FALSE),FALSE)","v":false}]
[{"$f":"IF(C13,2,IF(C12<>\"\",1,0))","v":0},"Rn",null,null,{"$f":"IF(G13,2,IF(G12<>\"\",1,0))","v":0},3]
[null,null,{"$f":"IFERROR(IF(_FV(_xlfn.XLOOKUP(C12,_FV(Table1[Element],\"name\"), Table1[Element],FALSE),\"atomic symbol\",TRUE)=B12,TRUE,FALSE),FALSE)","v":false},{"$nulls":3},{"$f":"IFERROR(IF(_FV(_xlfn.XLOOKUP(G12,_FV(Table1[Element],\"NAME\"),Table1[Element],FALSE),\"block\")=\"d\",TRUE,FALSE),FALSE)","v":false}]
[]
[null,"Which elements have the following atomic numbers?",null,null,{"$f":"IF(SUM(E16:E20)<>6,\"\",\"👏\")","v":""},"Name 3 elements that are commonly found in humans."]
{"$rows_left_out":18}
{"sheet":"Do more","index":7,"n_rows":18,"n_cols":3,"rows_kept":18,"merged":[[3,1,3,3],[7,2,7,3],[9,2,9,3],[10,2,10,3],[16,2,16,3],[17,2,17,3]]}
[]
[]
[null,"Do more with data types"]
[null,"With linked data types, you can insert and work with reliable data from trusted online data sources. Microsoft has partnered with Wolfram to provide rich, interesting facts and data on numerous subjects that you can use and refresh—all without leaving Excel."]
[null,"Here's how to use data types using the Space data type as an example."]
[null,"❶","Type Earth in the cell below."]
[]
[null,null,"You can type other names for the same thing. For example, you can type Planet Earth if you want."]
[]
[null,"❷","With the cell above selected, go to the Data tab and in the Data Type Gallery menu, select the Space icon. "]
[null,null,"If Excel doesn't recognize the planet, you'll get the option to search for the correct one or try another. "]
[]
[]
[null,"❸ ","Select the Insert Data icon that appears on the right of the cell to see a list of data options. Choose one or more options to add them to the sheet."]
[]
{"$rows_left_out":3}