{"text_format":"3","workbook":"xlsx","n_sheets":8,"sheets":["Welcome","Planet comparison","Planet explorer","Planet facts","Comet list","Comet lookup","Do more","Solar System - Computations"],"not_rendered":{"charts":2,"images":30,"defined_names":1},"read":"whole","date_system":"1900"}

{"sheet":"Welcome","index":0,"n_rows":16,"n_cols":16,"rows_kept":16,"merged":[[11,8,11,10],[15,1,15,4]]}
[null,null,"Refresh the workbook whenever you want to get the most up-to-date data for this template. Go to the Data tab  > Refresh All."]
[]
[null,"Planets and comets"]
[null,"To the stars and beyond! Discover facts about our planets and track the location of comets."]
[]
[]
[{"$nulls":3},"The planets of the Solar System",{"$nulls":5},"Compare planets by the numbers",{"$nulls":5},"Learn fun facts about each planet"]
[{"$nulls":3},"Planet explorer",{"$nulls":5},"Planet comparison",{"$nulls":5},"Planet facts"]
[]
[]
[]
[{"$nulls":3},"Track your favorite comets",{"$nulls":4},"Get to know the comets of the Solar System",{"$nulls":6},"Do more with data types"]
[{"$nulls":3},"Comet list",{"$nulls":5},"Comet lookup",{"$nulls":5},"Do more"]
[]
[]
{"$rows_left_out":2}
{"sheet":"Planet comparison","index":1,"n_rows":32,"n_cols":12,"rows_kept":32}
[]
[]
[null,null,"Compare planets by the numbers\t"]
[null,null,"Take a closer look at how different the planets are. The highest values for each property are highlighted in green."]
[]
[{"$nulls":4},{"$f":"IFERROR(_FV(E7,\"image\"), \"No image \")","v":{"$error":"#VALUE!"}},{"$f":"IFERROR(_FV(F7,\"image\"), \"No image\")","v":{"$error":"#VALUE!"}},{"$f":"IFERROR(_FV(G7,\"image\"), \"No image\")","v":{"$error":"#VALUE!"}},{"$f":"IFERROR(_FV(H7,\"image\"), \"No image\")","v":{"$error":"#VALUE!"}},{"$f":"IFERROR(_FV(I7,\"image\"), \"No image\")","v":{"$error":"#VALUE!"}},{"$f":"IFERROR(_FV(J7,\"image\"), \"No image\")","v":{"$error":"#VALUE!"}},{"$f":"IFERROR(_FV(K7,\"image\"), \"No image\")","v":{"$error":"#VALUE!"}},{"$f":"IFERROR(_FV(L7,\"image\"), \"No image\")","v":{"$error":"#VALUE!"}}]
[{"$nulls":4},{"$error":"#VALUE!"},{"$error":"#VALUE!"},{"$error":"#VALUE!"},{"$error":"#VALUE!"},{"$error":"#VALUE!"},{"$error":"#VALUE!"},{"$error":"#VALUE!"},{"$error":"#VALUE!"}]
[null,"Column1","Property","Measurement","Mercury","Venus","Earth","Mars","Jupiter","Saturn","Uranus","Neptune"]
[null,"Orbital properties","Orbital properties"]
[null,"Orbital properties","Current distance from Earth","au",{"$f":"IFERROR(_FV(_FV(E7,\"compute orbital properties\",TRUE),\"distance from Earth\",TRUE), \"Data not available\")","v":{"v":1.3175351507206863,"d":"1.32"}},{"$f":"IFERROR(_FV(_FV(F7,\"compute orbital properties\",TRUE),\"distance from Earth\",TRUE), \"Data not available\")","v":{"v":1.3355003655209654,"d":"1.34"}},{"$f":"IFERROR(_FV(_FV(G7,\"compute orbital properties\",TRUE),\"distance from Earth\",TRUE), \"Data not available\")","v":{"v":0,"d":"0.00"}},{"$f":"IFERROR(_FV(_FV(H7,\"compute orbital properties\",TRUE),\"distance from Earth\",TRUE), \"Data not available\")","v":{"v":2.546944584144114,"d":"2.55"}},{"$f":"IFERROR(_FV(_FV(I7,\"compute orbital properties\",TRUE),\"distance from Earth\",TRUE), \"Data not available\")","v":{"v":4.085888405520239,"d":"4.09"}},{"$f":"IFERROR(_FV(_FV(J7,\"compute orbital properties\",TRUE),\"distance from Earth\",TRUE), \"Data not available\")","v":{"v":8.938344616521366,"d":"8.94"}},{"$f":"IFERROR(_FV(_FV(K7,\"compute orbital properties\",TRUE),\"distance from Earth\",TRUE), \"Data not available\")","v":{"v":19.869427036151123,"d":"19.87"}},{"$f":"IFERROR(_FV(_FV(L7,\"compute orbital properties\",TRUE),\"distance from Earth\",TRUE), \"Data not available\")","v":{"v":29.219771882211152,"d":"29.22"}}]
[null,"Orbital properties","Average orbit distance","km",{"$f":"IFERROR(_FV(E7,\"average orbit distance\",TRUE),\"Data not available\")","v":{"v":0.39528297181294414,"d":"0.40"}},{"$f":"IFERROR(_FV(F7,\"average orbit distance\",TRUE),\"Data not available\")","v":{"v":0.7233485819788108,"d":"0.72"}},{"$f":"IFERROR(_FV(G7,\"average orbit distance\",TRUE),\"Data not available\")","v":{"v":1.0001397256814122,"d":"1.00"}},{"$f":"IFERROR(_FV(H7,\"average orbit distance\",TRUE),\"Data not available\")","v":{"v":1.5303099444973034,"d":"1.53"}},{"$f":"IFERROR(_FV(I7,\"average orbit distance\",TRUE),\"Data not available\")","v":{"v":5.209455756327183,"d":"5.21"}},{"$f":"IFERROR(_FV(J7,\"average orbit distance\",TRUE),\"Data not available\")","v":{"v":9.551053035374721,"d":"9.55"}},{"$f":"IFERROR(_FV(K7,\"average orbit distance\",TRUE),\"Data not available\")","v":{"v":19.21261222239082,"d":"19.21"}},{"$f":"IFERROR(_FV(L7,\"average orbit distance\",TRUE),\"Data not available\")","v":{"v":30.07007177754187,"d":"30.07"}}]
[null,"Orbital properties","Orbital period","Julian years",{"$f":"IFERROR(_FV(E7,\"orbital period\",TRUE),\"Data not available\")","v":{"v":0.2408467,"d":"0.24"}},{"$f":"IFERROR(_FV(F7,\"orbital period\",TRUE),\"Data not available\")","v":{"v":0.61519726,"d":"0.62"}},{"$f":"IFERROR(_FV(G7,\"orbital period\",TRUE),\"Data not available\")","v":{"v":1.0000174,"d":"1.00"}},{"$f":"IFERROR(_FV(H7,\"orbital period\",TRUE),\"Data not available\")","v":{"v":1.8808476,"d":"1.88"}},{"$f":"IFERROR(_FV(I7,\"orbital period\",TRUE),\"Data not available\")","v":{"v":11.862615,"d":"11.86"}},{"$f":"IFERROR(_FV(J7,\"orbital period\",TRUE),\"Data not available\")","v":{"v":29.447498,"d":"29.45"}},{"$f":"IFERROR(_FV(K7,\"orbital period\",TRUE),\"Data not available\")","v":{"v":84.016846,"d":"84.02"}},{"$f":"IFERROR(_FV(L7,\"orbital period\",TRUE),\"Data not available\")","v":{"v":164.79132,"d":"164.79"}}]
[null,"Orbital properties","Average orbit velocity","km/s",{"$f":"IFERROR(_FV(E7,\"average orbit velocity\",TRUE),\"Data not available\")","v":{"v":47.36190419281275,"d":"47.36"}},{"$f":"IFERROR(_FV(F7,\"average orbit velocity\",TRUE),\"Data not available\")","v":{"v":35.020241574296094,"d":"35.02"}},{"$f":"IFERROR(_FV(G7,\"average orbit velocity\",TRUE),\"Data not available\")","v":{"v":29.782600175500328,"d":"29.78"}},{"$f":"IFERROR(_FV(H7,\"average orbit velocity\",TRUE),\"Data not available\")","v":{"v":24.076790841409252,"d":"24.08"}},{"$f":"IFERROR(_FV(I7,\"average orbit velocity\",TRUE),\"Data not available\")","v":{"v":13.049577258757397,"d":"13.05"}},{"$f":"IFERROR(_FV(J7,\"average orbit velocity\",TRUE),\"Data not available\")","v":{"v":9.637553486425793,"d":"9.64"}},{"$f":"IFERROR(_FV(K7,\"average orbit velocity\",TRUE),\"Data not available\")","v":{"v":6.795156194191339,"d":"6.80"}},{"$f":"IFERROR(_FV(L7,\"average orbit velocity\",TRUE),\"Data not available\")","v":{"v":5.431574268220868,"d":"5.43"}}]
[null,"Orbital properties","Orbital inclination","degrees",{"$f":"IFERROR(_FV(E7,\"orbital inclination\",TRUE),\"Data not available\")","v":{"v":7.00487,"d":"7.00"}},{"$f":"IFERROR(_FV(F7,\"orbital inclination\",TRUE),\"Data not available\")","v":{"v":3.39471,"d":"3.39"}},{"$f":"IFERROR(_FV(G7,\"orbital inclination\",TRUE),\"Data not available\")","v":{"v":5.0000000000000023E-5,"d":"0.00"}},{"$f":"IFERROR(_FV(H7,\"orbital inclination\",TRUE),\"Data not available\")","v":{"v":1.85061,"d":"1.85"}},{"$f":"IFERROR(_FV(I7,\"orbital inclination\",TRUE),\"Data not available\")","v":{"v":1.3053,"d":"1.31"}},{"$f":"IFERROR(_FV(J7,\"orbital inclination\",TRUE),\"Data not available\")","v":{"v":2.48446,"d":"2.48"}},{"$f":"IFERROR(_FV(K7,\"orbital inclination\",TRUE),\"Data not available\")","v":{"v":0.76986,"d":"0.77"}},{"$f":"IFERROR(_FV(L7,\"orbital inclination\",TRUE),\"Data not available\")","v":{"v":1.76917,"d":"1.77"}}]
[null,"Orbital properties","Orbital eccentricity",null,{"$f":"IFERROR(_FV(E7,\"orbital eccentricity\",TRUE),\"Data not available\")","v":{"v":0.20563069,"d":"0.21"}},{"$f":"IFERROR(_FV(F7,\"orbital eccentricity\",TRUE),\"Data not available\")","v":{"v":0.00677323,"d":"0.01"}},{"$f":"IFERROR(_FV(G7,\"orbital eccentricity\",TRUE),\"Data not available\")","v":{"v":0.01671022,"d":"0.02"}},{"$f":"IFERROR(_FV(H7,\"orbital eccentricity\",TRUE),\"Data not available\")","v":{"v":0.09341233,"d":"0.09"}},{"$f":"IFERROR(_FV(I7,\"orbital eccentricity\",TRUE),\"Data not available\")","v":{"v":0.04839266,"d":"0.05"}},{"$f":"IFERROR(_FV(J7,\"orbital eccentricity\",TRUE),\"Data not available\")","v":{"v":0.0541506,"d":"0.05"}},{"$f":"IFERROR(_FV(K7,\"orbital eccentricity\",TRUE),\"Data not available\")","v":{"v":0.04716771,"d":"0.05"}},{"$f":"IFERROR(_FV(L7,\"orbital eccentricity\",TRUE),\"Data not available\")","v":{"v":0.00858587,"d":"0.01"}}]
{"$rows_left_out":18}
{"sheet":"Planet explorer","index":2,"n_rows":16,"n_cols":15,"rows_kept":16,"merged":[[5,1,5,5],[13,2,13,3],[13,4,13,5],[13,6,13,7],[13,8,13,9]]}
[]
[]
[null,"The planets of the Solar System"]
[null,"Compare the planets of the Solar System by their physical, orbital, and atmospheric properties. "]
[null,"Select the cell below and choose a property using the dropdown arrow."]
[null,"Mass"]
[]
[]
[]
[null,{"$f":"IFERROR(_xlfn.IFS($B$6=\"Volume\",\"Charts scale is 1:10,000,000,000,000,000.\",$B$6=\"Surface area\", \"Charts scale is 1:1,000,000.\", $B$6=\"Mass\", \"Charts scale is 1:10,000,000,000,000,000,000.\"), \"\")","v":"Charts scale is 1:10,000,000,000,000,000,000."}]
[]
[null,null,{"$f":"IFERROR(_FV(C14,\"image\"), \"\")","v":{"$error":"#VALUE!"}},null,{"$f":"IFERROR(_FV(E14,\"image\"),\"\")","v":{"$error":"#VALUE!"}},null,{"$f":"IFERROR(_FV(G14,\"image\"), \"\")","v":{"$error":"#VALUE!"}},null,{"$f":"IFERROR(_FV(I14,\"image\"), \"\")","v":{"$error":"#VALUE!"}},null,{"$f":"IFERROR(_FV(K14,\"image\"), \"\")","v":{"$error":"#VALUE!"}},{"$f":"IFERROR(_FV(L14,\"image\"), \"\")","v":{"$error":"#VALUE!"}},{"$f":"IFERROR(_FV(M14,\"image\"), \"\")","v":{"$error":"#VALUE!"}},null,{"$f":"IFERROR(_FV(O14,\"image\"), \"\")","v":{"$error":"#VALUE!"}}]
[]
[null,null,{"$error":"#VALUE!"},null,{"$error":"#VALUE!"},null,{"$error":"#VALUE!"},null,{"$error":"#VALUE!"},null,{"$error":"#VALUE!"},{"$error":"#VALUE!"},{"$error":"#VALUE!"},null,{"$error":"#VALUE!"}]
[]
{"$rows_left_out":2}
{"sheet":"Planet facts","index":3,"n_rows":37,"n_cols":10,"rows_kept":37,"merged":[[4,6,6,6],[9,6,9,7],[10,6,10,7],[15,6,15,9],[19,6,19,9],[22,1,22,4],[22,6,22,9]]}
[]
[]
[null,"Learn fun facts about each planet"]
[null,"Get to know some stellar facts about each planet! "]
[null,"Select the cell below and choose a planet using the dropdown arrow.",{"$nulls":4},{"$f":"IFERROR(_FV(B6,\"image\"), \"No image available\")","v":{"$error":"#VALUE!"}}]
[null,{"$error":"#VALUE!"}]
[]
[]
[null,{"$f":"IF(_FV($B$6,\"name\")=\"Earth\",\"Size of Earth\",_xlfn.CONCAT(\"Size of \",_FV($B$6,\"name\"),\" compared to Earth\"))","v":"Size of Mercury compared to Earth"}]
[null,"Earth's radius",null,{"$f":"_FV('Solar System - Computations'!B6,\"average radius\",TRUE)","v":{"v":6371.008766666667,"d":"6,371.01"}},"m",null,{"$f":"IF(_FV(B6,\"name\")=\"Earth\", \"\", _xlfn.CONCAT(\"Radius of \",_FV( $B$6,\"name\"),\" compared to Earth's:\"))","v":"Radius of Mercury compared to Earth's:"},null,{"$f":"IF(G10=\"\",\"\",_FV($B$6,\"average radius\",TRUE)/$D$10)","v":{"v":0.38293778730373007,"d":"0.38"}}]
[null,"Earth's surface area",null,{"$f":"_FV('Solar System - Computations'!B6,\"surface area\",TRUE)","v":{"v":510065620.9634326,"d":"510,065,620.96"}},"km²",null,{"$f":"IF(_FV(B6,\"name\")=\"Earth\", \"\", _xlfn.CONCAT(\"Surface area of \",_FV( $B$6,\"name\"),\" compared to Earth's:\"))","v":"Surface area of Mercury compared to Earth's:"},null,{"$f":"IF(G11=\"\", \"\",_FV( $B$6,\"surface area\",TRUE)/$D$11)","v":{"v":0.14664142216204235,"d":"0.15"}}]
[]
[null,{"$f":"_xlfn.CONCAT(\"Your weight on \",_FV( $B$6,\"name\"))","v":"Your weight on Mercury"}]
[]
[null,"Enter your weight and pick the unit (kg or lbs):",null,null,"lb",null,{"$f":"_xlfn.CONCAT(\"Your weight on \",_FV( $B$6,\"name\"), \": \")","v":"Your weight on Mercury: "},null,{"$f":"IFERROR(IF(E15=\"kg\",($D15/'Solar System - Computations'!G6)*_FV($B$6,\"gravity\"), ($D15/2.20462262/'Solar System - Computations'!G6)*_FV($B$6,\"gravity\")*2.20462262), 0)","v":{"v":0,"d":"0.0"}},{"$f":"E15","v":"lb"}]
{"$rows_left_out":23}
{"sheet":"Comet list","index":4,"n_rows":16,"n_cols":4,"rows_kept":16,"merged":[[3,1,3,3],[4,2,4,3],[5,2,5,3],[6,2,6,3]]}
[]
[]
[null,"Track your favorite comets"]
[null,"Keep track of your favorite comets and use the Comet lookup sheet to learn more about them. To add comets to the list, edit the examples or type below the last comet in the blue highlighted cell."]
[null,null,"Click the icon next to a comet to view more data about it."]
[null,null,"If you don't see data for a comet, you may need to convert it to the Space data type: select the comet name, go to the Data tab, and in the Data Types gallery menu, select the Space icon."]
[null,null,"To add more columns of information, select a star and then click on the Add Column icon in the top right corner of the list."]
[]
[null,null,"Comets","Average orbit velocity"]
[null,null,{"$error":"#VALUE!"},{"$f":"IFERROR(_FV(Table2[[#This Row],[Comets]],\"average orbit velocity\",TRUE), \"\")","v":4.8234471093837525}]
[null,null,{"$error":"#VALUE!"},{"$f":"IFERROR(_FV(Table2[[#This Row],[Comets]],\"average orbit velocity\",TRUE), \"\")","v":7.67132218782897}]
[null,null,{"$error":"#VALUE!"},{"$f":"IFERROR(_FV(Table2[[#This Row],[Comets]],\"average orbit velocity\",TRUE), \"\")","v":1.4278977115331004}]
[null,null,{"$error":"#VALUE!"},{"$f":"IFERROR(_FV(Table2[[#This Row],[Comets]],\"average orbit velocity\",TRUE), \"\")","v":15.668308671788257}]
[null,null,{"$error":"#VALUE!"},{"$f":"IFERROR(_FV(Table2[[#This Row],[Comets]],\"average orbit velocity\",TRUE), \"\")","v":14.5096589857703}]
[null,null,{"$error":"#VALUE!"},{"$f":"IFERROR(_FV(Table2[[#This Row],[Comets]],\"average orbit velocity\",TRUE), \"\")","v":0.39800395565644836}]
{"$rows_left_out":2}
{"sheet":"Comet lookup","index":5,"n_rows":27,"n_cols":8,"rows_kept":27,"merged":[[9,1,9,3],[9,5,9,7]]}
[]
[]
[null,"Get to know the comets of the Solar System "]
[null,"Look up any comet from your Comet list and find out if it's in viewing range from where you are. "]
[null,"Select the cell below and choose a comet using the dropdown arrow."]
[null,{"$error":"#VALUE!"}]
[]
[null,"Current solar system configuration",{"$nulls":3},"Current sky map from your location *"]
[]
[null,{"$f":"IFERROR(_FV(B6,\"current solar system configuration\",TRUE), \"No current solar system configuration available\")","v":{"$error":"#VALUE!"}},{"$nulls":3},{"$f":"IFERROR(_FV(B6,\"current sky map from user location\",TRUE),\"No current sky map available\")","v":{"$error":"#VALUE!"}}]
[]
[null,"Orbital properties",{"$nulls":3},"Physical properties"]
[null,"Orbit Center",{"$f":"IFERROR(_FV(B6,\"orbit center\",TRUE), \"Data not available\")","v":{"$error":"#VALUE!"}},null,null,"Apparent magnitude",{"$f":"IFERROR(_FV(B6,\"apparent magnitude\",TRUE), \"Data not available\")","v":21.988631582783178}]
[null,"Average distance from Earth",{"$f":"IFERROR(_FV(B6,\"average distance from Earth\",TRUE), \"Data not available\")","v":{"v":4.2298618518907665,"d":"4.23"}},"au",null,"Average radius",{"$f":"IFERROR(_FV(B6,\"average radius\",TRUE), \"Data not available\")","v":1.6},"km"]
[null,"Largest distance from the Sun",{"$f":"IFERROR(_FV(B6,\"largest distance from the Sun\",TRUE), \"Data not available\")","v":{"v":823021714.81382,"d":"8.23E+08"}},"km",null,"Volume",{"$f":"IFERROR(_FV(B6,\"volume\"), \"Data not available\")","v":{"v":17157284678.805058,"d":"1.72E+10"}},"km³"]
{"$rows_left_out":13}
{"sheet":"Do more","index":6,"n_rows":18,"n_cols":3,"rows_kept":18,"merged":[[3,1,3,3],[7,2,7,3],[9,2,9,3],[10,2,10,3],[16,2,16,3],[17,2,17,3]]}
[]
[]
[null,"Do more with data types"]
[null,"With linked data types, you can insert and work with reliable data from trusted online data sources. Microsoft has partnered with Wolfram to provide rich, interesting facts and data on numerous subjects that you can use and refresh—all without leaving Excel."]
[null,"Here's how to use data types using the Space data type as an example."]
[null,"❶","Type Earth in the cell below."]
[]
[null,null,"You can type other names for the same thing. For example, you can type Planet Earth if you want."]
[]
[null,"❷","With the cell above selected, go to the Data tab and in the Data Type Gallery menu, select the Space icon. "]
[null,null,"If Excel doesn't recognize the planet, you'll get the option to search for the correct one or try another. "]
[]
[]
[null,"❸ ","Select the Insert Data icon that appears on the right of the cell to see a list of data options. Choose one or more options to add them to the sheet."]
[]
{"$rows_left_out":4}
{"sheet":"Solar System - Computations","index":7,"n_rows":52,"n_cols":15,"rows_kept":52,"hidden":true,"merged":[[12,1,12,3],[25,1,25,3]]}
[null,null,"Average temperature","Mass","Average orbit distance","Average distance from Earth","Gravity","Rotation period","Orbital period","Equatorial radius","Average orbit velocity","Volume","Surface area"]
[null,"Unit","˚C","kg","au","au","m/s²","Earth days","Julian years","km","km/s","m³","km²"]
["Strings","Planets","Average temperature","Mass","Average orbit distance","Average distance from Earth","Gravity","Rotation period","Orbital period","Equatorial radius","Average orbit velocity","Volume","Surface area","number of moons","obliquity"]
["Mercury",{"$error":"#VALUE!"},{"$f":"_FV(B4,\"average temperature\",TRUE)","v":178.85},{"$f":"_FV(B4,\"mass\")/10000000000000000000","v":{"v":33011.291443914364,"d":"3.3E+04"}},{"$f":"_FV(B4,\"average orbit distance\",TRUE)","v":{"v":0.39528297181294414,"d":"0.40"}},{"$f":"_FV(B4,\"average distance from Earth\",TRUE)","v":{"v":1.0389265527271352,"d":"1.04"}},{"$f":"_FV(B4,\"gravity\")","v":{"v":3.7,"d":"3.70"}},{"$f":"_FV(B4,\"rotation period\",TRUE)","v":{"v":58.6462,"d":"58.65"}},{"$f":"_FV(B4,\"orbital period\",TRUE)","v":{"v":0.2408467,"d":"0.24"}},{"$f":"_FV(B4,\"equatorial radius\",TRUE)","v":{"v":2439.7,"d":"2439.70"}},{"$f":"_FV(B4,\"average orbit velocity\",TRUE)","v":{"v":47.36190419281275,"d":"47.36"}},{"$f":"_FV(B4,\"volume\")/10000000000000000","v":{"v":6082.720874248266,"d":"6.08E+03"}},{"$f":"_FV(B4,\"surface area\",TRUE)/1000000","v":{"v":74.796748054043,"d":"7.48E+01"}},{"$f":"_FV(B4,\"number of moons\",TRUE)","v":{"v":0,"d":"0.00"}},{"$f":"_FV(B4,\"obliquity\")","v":0.01}]
["Venus",{"$error":"#VALUE!"},{"$f":"_FV(B5,\"average temperature\",TRUE)","v":463.85},{"$f":"_FV(B5,\"mass\")/10000000000000000000","v":{"v":486747.2370723754,"d":"4.9E+05"}},{"$f":"_FV(B5,\"average orbit distance\",TRUE)","v":{"v":0.7233485819788108,"d":"0.72"}},{"$f":"_FV(B5,\"average distance from Earth\",TRUE)","v":{"v":1.136117789474396,"d":"1.14"}},{"$f":"_FV(B5,\"gravity\")","v":8.87},{"$f":"ABS(_FV(B5,\"rotation period\",TRUE))","v":{"v":243.018,"d":"243.02"}},{"$f":"_FV(B5,\"orbital period\",TRUE)","v":{"v":0.61519726,"d":"0.62"}},{"$f":"_FV(B5,\"equatorial radius\",TRUE)","v":{"v":6051.8,"d":"6051.80"}},{"$f":"_FV(B5,\"average orbit velocity\",TRUE)","v":{"v":35.020241574296094,"d":"35.02"}},{"$f":"_FV(B5,\"volume\")/10000000000000000","v":{"v":92841.53458928592,"d":"9.28E+04"}},{"$f":"_FV(B5,\"surface area\",TRUE)/1000000","v":{"v":460.234316679103,"d":"4.60E+02"}},{"$f":"_FV(B5,\"number of moons\",TRUE)","v":{"v":0,"d":"0.00"}},{"$f":"_FV(B5,\"obliquity\")","v":177.36}]
["Earth",{"$error":"#VALUE!"},{"v":14,"d":"14.00"},{"$f":"_FV(B6,\"mass\")/10000000000000000000","v":{"v":597220,"d":"6.0E+05"}},{"v":1.0001397256814122,"d":"1.00"},{"v":0,"d":"0.00"},{"v":9.8,"d":"9.80"},{"$f":"_FV(B6,\"rotation period\",TRUE)","v":{"v":0.99726968,"d":"1.00"}},{"$f":"_FV(B6,\"orbital period\",TRUE)","v":{"v":1.0000174,"d":"1.00"}},{"$f":"_FV(B6,\"equatorial radius\",TRUE)","v":{"v":6378.137,"d":"6378.14"}},{"$f":"_FV(B6,\"average orbit velocity\",TRUE)","v":{"v":29.782600175500328,"d":"29.78"}},{"$f":"_FV(B6,\"volume\")/10000000000000000","v":{"v":108320.73173739921,"d":"1.08E+05"}},{"$f":"_FV(B6,\"surface area\",TRUE)/1000000","v":{"v":510.0656209634326,"d":"5.10E+02"}},{"$f":"_FV(B6,\"number of moons\",TRUE)","v":{"v":1,"d":"1.00"}},{"$f":"_FV(B6,\"obliquity\")","v":23.45}]
["Mars",{"$error":"#VALUE!"},-47.15,{"$f":"_FV(B7,\"mass\")/10000000000000000000","v":{"v":64171.19662934817,"d":"6.4E+04"}},{"v":1.5303099444973034,"d":"1.53"},{"v":1.7010837110410975,"d":"1.70"},3.71,{"$f":"_FV(B7,\"rotation period\",TRUE)","v":{"v":1.02595676,"d":"1.03"}},{"$f":"_FV(B7,\"orbital period\",TRUE)","v":{"v":1.8808476,"d":"1.88"}},{"$f":"_FV(B7,\"equatorial radius\",TRUE)","v":3396.19},{"$f":"_FV(B7,\"average orbit velocity\",TRUE)","v":{"v":24.076790841409252,"d":"24.08"}},{"$f":"_FV(B7,\"volume\")/10000000000000000","v":{"v":16311.75660780334,"d":"1.63E+04"}},{"$f":"_FV(B7,\"surface area\",TRUE)/1000000","v":{"v":144.373440507178,"d":"1.44E+02"}},{"$f":"_FV(B7,\"number of moons\",TRUE)","v":{"v":2,"d":"2.00"}},{"$f":"_FV(B7,\"obliquity\")","v":25.19}]
["Jupiter",{"$error":"#VALUE!"},-108.15,{"$f":"_FV(B8,\"mass\")/10000000000000000000","v":{"v":189818722.5804905,"d":"1.9E+08"}},{"v":5.209455756327183,"d":"5.21"},{"v":5.257608661563999,"d":"5.26"},24.79,{"$f":"_FV(B8,\"rotation period\",TRUE)","v":{"v":0.41354,"d":"0.41"}},{"$f":"_FV(B8,\"orbital period\",TRUE)","v":{"v":11.862615,"d":"11.86"}},{"$f":"_FV(B8,\"equatorial radius\",TRUE)","v":{"v":71492,"d":"71492.00"}},{"$f":"_FV(B8,\"average orbit velocity\",TRUE)","v":{"v":13.049577258757397,"d":"13.05"}},{"$f":"_FV(B8,\"volume\")/10000000000000000","v":{"v":143130075.28575942,"d":"1.43E+08"}},{"$f":"_FV(B8,\"surface area\",TRUE)/1000000","v":{"v":61468.93018571893,"d":"6.15E+04"}},{"$f":"_FV(B8,\"number of moons\",TRUE)","v":{"v":79,"d":"79.00"}},{"$f":"_FV(B8,\"obliquity\")","v":3.13}]
["Saturn",{"$error":"#VALUE!"},-139.15,{"$f":"_FV(B9,\"mass\")/10000000000000000000","v":{"v":56833581.55730827,"d":"5.7E+07"}},{"v":9.551053035374721,"d":"9.55"},{"v":9.575985961141454,"d":"9.58"},10.44,{"$f":"_FV(B9,\"rotation period\",TRUE)","v":{"v":0.44002314814814814,"d":"0.44"}},{"$f":"_FV(B9,\"orbital period\",TRUE)","v":{"v":29.447498,"d":"29.45"}},{"$f":"_FV(B9,\"equatorial radius\",TRUE)","v":{"v":60268,"d":"60268.00"}},{"$f":"_FV(B9,\"average orbit velocity\",TRUE)","v":{"v":9.637553486425793,"d":"9.64"}},{"$f":"_FV(B9,\"volume\")/10000000000000000","v":{"v":82712961.78170307,"d":"8.27E+07"}},{"$f":"_FV(B9,\"surface area\",TRUE)/1000000","v":{"v":42693.9658280163,"d":"4.27E+04"}},{"$f":"_FV(B9,\"number of moons\",TRUE)","v":{"v":82,"d":"82.00"}},{"$f":"_FV(B9,\"obliquity\")","v":26.73}]
["Uranus",{"$error":"#VALUE!"},-197.15,{"$f":"_FV(B10,\"mass\")/10000000000000000000","v":{"v":8681254.944501715,"d":"8.7E+06"}},{"v":19.21261222239082,"d":"19.21"},{"v":19.225205335290685,"d":"19.23"},8.87,{"$f":"ABS(_FV(B10,\"rotation period\",TRUE))","v":{"v":0.71833,"d":"0.72"}},{"$f":"_FV(B10,\"orbital period\",TRUE)","v":{"v":84.016846,"d":"84.02"}},{"$f":"_FV(B10,\"equatorial radius\",TRUE)","v":{"v":25559,"d":"25559.00"}},{"$f":"_FV(B10,\"average orbit velocity\",TRUE)","v":{"v":6.795156194191339,"d":"6.80"}},{"$f":"_FV(B10,\"volume\")/10000000000000000","v":{"v":6833560.479317905,"d":"6.83E+06"}},{"$f":"_FV(B10,\"surface area\",TRUE)/1000000","v":{"v":8083.954116967616,"d":"8.08E+03"}},{"$f":"_FV(B10,\"number of moons\",TRUE)","v":{"v":27,"d":"27.00"}},{"$f":"_FV(B10,\"obliquity\")","v":97.77}]
["Neptune",{"$error":"#VALUE!"},-201.15,{"$f":"_FV(B11,\"mass\")/10000000000000000000","v":{"v":10243402.836046318,"d":"1.0E+07"}},{"v":30.07007177754187,"d":"30.07"},{"v":30.078279952336246,"d":"30.08"},11.15,{"$f":"_FV(B11,\"rotation period\",TRUE)","v":{"v":0.67125,"d":"0.67"}},{"$f":"_FV(B11,\"orbital period\",TRUE)","v":{"v":164.79132,"d":"164.79"}},{"$f":"_FV(B11,\"equatorial radius\",TRUE)","v":{"v":24764,"d":"24764.00"}},{"$f":"_FV(B11,\"average orbit velocity\",TRUE)","v":{"v":5.431574268220868,"d":"5.43"}},{"$f":"_FV(B11,\"volume\")/10000000000000000","v":{"v":6252714.747170231,"d":"6.25E+06"}},{"$f":"_FV(B11,\"surface area\",TRUE)/1000000","v":{"v":7618.793138616182,"d":"7.62E+03"}},{"$f":"_FV(B11,\"number of moons\",TRUE)","v":{"v":14,"d":"14.00"}},{"$f":"_FV(B11,\"obliquity\")","v":28.32}]
[]
[null,"Calculations for the dashboard of sheet 2"]
[null,"Planets",{"$f":"'Planet explorer'!B6","v":"Mass"},"Unit"]
[null,{"$error":"#VALUE!"},{"$f":"INDEX($C$4:$M$11,MATCH($B15,$B$4:$B$11,0),MATCH($C$14,$C$3:$M$3,0))","v":{"v":33011.291443914364,"d":"33,011.29"}},{"$f":"_xlfn.CONCAT(C14, \" (\", INDEX(C2:M2,MATCH(D14,B2,0),MATCH(C14,C1:M1,0)), \")\")","v":"Mass (kg)"}]
{"$rows_left_out":37}